{"text_format":"1","workbook":"xlsx","n_sheets":4,"sheets":["1_Determine Priorities","2_Choose Actions","3_Finalize Your Plan","Lists and Sum"],"not_rendered":{"charts":0,"images":1,"macros":1,"external_links":0,"defined_names":7,"comments":0,"pivot_tables":0},"unopened":[],"bounds":{"document_bytes":16777216,"sheet_cells":100000,"rows_first":2000,"rows_last":500,"rows_between":2000,"halvings":0,"cell_chars":16384,"cell_head_chars":4096},"cells_cut":0,"cells_raw":0,"read":"whole","date_system":"1900"}

{"sheet":"1_Determine Priorities","index":0,"n_rows":38,"n_cols":14,"rows_kept":38,"cut":false,"hidden":false,"merged":[[1,1,1,9],[3,2,4,7],[3,8,5,8]]}
[null,null,null,null,null,null,null,null,null,"Student Success Collaborative"]
[null,"Step One: Determine Your Priorities for Student Interventions"]
[]
[null,null,"Instructions: Use this diagnostic to determine priorities for your upcoming student interventions. Select responses to each diagnostic question via the dropdown options. The \"TOTAL\" column will update automatically and suggest student needs/subpopulations to include in your intervention plan this academic year. Then make your final selections for which interventions to include in your plan by selecting \"Yes\" in the far right column. Then move on to the next tab of this workbook."]
[]
[]
[null,null,"Category","Student Need/Subpopulation","What level of priority is this for your institution to put additional attention on?","How well do you think this student need or subpopulation is being addressed? ","How much effort would be needed to better address this student need or subpopulation?","TOTAL","Include in your intervention plan for this academic year?",null,null,"How well do you think this student need or subpopulation is being addressed? ","How much effort would be needed to better address this student need or subpopulation?","What level of priority is this for your institution to put additional attention on?"]
[null,null,"Basic Needs and Wellness","Lack of technology or Wi-Fi",null,null,null,{"$f":"IF(SUM(L8:N8)=0,\"\",SUM(L8:N8))","v":""},"No",null,null,{"$f":"IFERROR(VLOOKUP($F8,'Lists and Sum'!$A$2:$B$6,2,0),\"\")","v":""},{"$f":"IFERROR(VLOOKUP($G8,'Lists and Sum'!$C$2:$D$6,2,0),\"\")","v":""},{"$f":"IFERROR(VLOOKUP($E8,'Lists and Sum'!$E$2:$F$6,2,0),\"\")","v":""}]
[null,null,"Basic Needs and Wellness","Mental health concerns",null,null,null,{"$f":"IF(SUM(L9:N9)=0,\"\",SUM(L9:N9))","v":""},"No",null,null,{"$f":"IFERROR(VLOOKUP($F9,'Lists and Sum'!$A$2:$B$6,2,0),\"\")","v":""},{"$f":"IFERROR(VLOOKUP($G9,'Lists and Sum'!$C$2:$D$6,2,0),\"\")","v":""},{"$f":"IFERROR(VLOOKUP($E9,'Lists and Sum'!$E$2:$F$6,2,0),\"\")","v":""}]
[null,null,"Basic Needs and Wellness","Physical health concerns",null,null,null,"","No",null,null,{"$f":"IFERROR(VLOOKUP($F10,'Lists and Sum'!$A$2:$B$6,2,0),\"\")","v":""},{"$f":"IFERROR(VLOOKUP($G10,'Lists and Sum'!$C$2:$D$6,2,0),\"\")","v":""},{"$f":"IFERROR(VLOOKUP($E10,'Lists and Sum'!$E$2:$F$6,2,0),\"\")","v":""}]
[null,null,"Basic Needs and Wellness","Food insecurity",null,null,null,"","No",null,null,{"$f":"IFERROR(VLOOKUP($F11,'Lists and Sum'!$A$2:$B$6,2,0),\"\")","v":""},{"$f":"IFERROR(VLOOKUP($G11,'Lists and Sum'!$C$2:$D$6,2,0),\"\")","v":""},{"$f":"IFERROR(VLOOKUP($E11,'Lists and Sum'!$E$2:$F$6,2,0),\"\")","v":""}]
[null,null,"Basic Needs and Wellness","Housing insecurity",null,null,null,"","No",null,null,{"$f":"IFERROR(VLOOKUP($F12,'Lists and Sum'!$A$2:$B$6,2,0),\"\")","v":""},{"$f":"IFERROR(VLOOKUP($G12,'Lists and Sum'!$C$2:$D$6,2,0),\"\")","v":""},{"$f":"IFERROR(VLOOKUP($E12,'Lists and Sum'!$E$2:$F$6,2,0),\"\")","v":""}]
[null,null,"Financial","Unmet financial need or change in financial circumstances",null,null,null,"","No",null,null,{"$f":"IFERROR(VLOOKUP($F13,'Lists and Sum'!$A$2:$B$6,2,0),\"\")","v":""},{"$f":"IFERROR(VLOOKUP($G13,'Lists and Sum'!$C$2:$D$6,2,0),\"\")","v":""},{"$f":"IFERROR(VLOOKUP($E13,'Lists and Sum'!$E$2:$F$6,2,0),\"\")","v":""}]
[null,null,"Financial","Missing out on aid / FAFSA not filed",null,null,null,"","No",null,null,{"$f":"IFERROR(VLOOKUP($F14,'Lists and Sum'!$A$2:$B$6,2,0),\"\")","v":""},{"$f":"IFERROR(VLOOKUP($G14,'Lists and Sum'!$C$2:$D$6,2,0),\"\")","v":""},{"$f":"IFERROR(VLOOKUP($E14,'Lists and Sum'!$E$2:$F$6,2,0),\"\")","v":""}]
[null,null,"Financial","Outstanding balances preventing registration",null,null,null,"","No",null,null,{"$f":"IFERROR(VLOOKUP($F15,'Lists and Sum'!$A$2:$B$6,2,0),\"\")","v":""},{"$f":"IFERROR(VLOOKUP($G15,'Lists and Sum'!$C$2:$D$6,2,0),\"\")","v":""},{"$f":"IFERROR(VLOOKUP($E15,'Lists and Sum'!$E$2:$F$6,2,0),\"\")","v":""}]
[null,null,"Financial","Student employment needs",null,null,null,"","No",null,null,{"$f":"IFERROR(VLOOKUP($F16,'Lists and Sum'!$A$2:$B$6,2,0),\"\")","v":""},{"$f":"IFERROR(VLOOKUP($G16,'Lists and Sum'!$C$2:$D$6,2,0),\"\")","v":""},{"$f":"IFERROR(VLOOKUP($E16,'Lists and Sum'!$E$2:$F$6,2,0),\"\")","v":""}]
[null,null,"Engagement and Belonging","Virtual or hybrid environment engagement",null,null,null,"","No",null,null,{"$f":"IFERROR(VLOOKUP($F17,'Lists and Sum'!$A$2:$B$6,2,0),\"\")","v":""},{"$f":"IFERROR(VLOOKUP($G17,'Lists and Sum'!$C$2:$D$6,2,0),\"\")","v":""},{"$f":"IFERROR(VLOOKUP($E17,'Lists and Sum'!$E$2:$F$6,2,0),\"\")","v":""}]
[null,null,"Engagement and Belonging","Lack of confidence",null,null,null,"","No",null,null,{"$f":"IFERROR(VLOOKUP($F18,'Lists and Sum'!$A$2:$B$6,2,0),\"\")","v":""},{"$f":"IFERROR(VLOOKUP($G18,'Lists and Sum'!$C$2:$D$6,2,0),\"\")","v":""},{"$f":"IFERROR(VLOOKUP($E18,'Lists and Sum'!$E$2:$F$6,2,0),\"\")","v":""}]
[null,null,"Engagement and Belonging","Campus culture or climate",null,null,null,"","No",null,null,{"$f":"IFERROR(VLOOKUP($F19,'Lists and Sum'!$A$2:$B$6,2,0),\"\")","v":""},{"$f":"IFERROR(VLOOKUP($G19,'Lists and Sum'!$C$2:$D$6,2,0),\"\")","v":""},{"$f":"IFERROR(VLOOKUP($E19,'Lists and Sum'!$E$2:$F$6,2,0),\"\")","v":""}]
[null,null,"Engagement and Belonging","Relationships with peers",null,null,null,"","No",null,null,{"$f":"IFERROR(VLOOKUP($F20,'Lists and Sum'!$A$2:$B$6,2,0),\"\")","v":""},{"$f":"IFERROR(VLOOKUP($G20,'Lists and Sum'!$C$2:$D$6,2,0),\"\")","v":""},{"$f":"IFERROR(VLOOKUP($E20,'Lists and Sum'!$E$2:$F$6,2,0),\"\")","v":""}]
{"$rows_left_out":19}
{"sheet":"2_Choose Actions","index":1,"n_rows":77,"n_cols":9,"rows_kept":77,"cut":false,"hidden":false,"merged":[[1,1,1,8],[3,7,5,7],[3,2,4,4]]}
[null,null,null,null,null,null,null,null,"Student Success Collaborative"]
[null,"Step Two: Choose Specific Intervention Actions for Each Priority"]
[]
[null,null,"Instructions: Now that you have selected your priorities, use the table below to choose specific intervention actions for each priority. \nClick the button to the right to automatically refresh the table below with your specific priorities from the previous tab. \nYou may choose to include all intervention actions in your final plan, or only some. Select \"Yes\" in the far right column to make your final selection. \nThen move on to the next tab of this workbook."]
[]
[]
[null,null,"Category","Student Need/Subpopulation","Intervention Action","Code","Priority?","Include in your intervention plan for this academic year?"]
[null,null,"Basic Needs and Wellness","Lack of technology or Wi-Fi","Refer students to IT department to get access to a loaner laptop or wifi hot spot.","a1",{"$f":"VLOOKUP(Index6[[#This Row],[Student Need/Subpopulation]],Table3[[Student Need/Subpopulation]:[Include in your intervention plan for this academic year?]],6,0)","v":"No"},"No"]
[null,null,"Basic Needs and Wellness","Lack of technology or Wi-Fi","Send application to the student hardship fund/emergency grants to apply for funds to purchase laptop or wifi hot spot.","a2",{"$f":"VLOOKUP(Index6[[#This Row],[Student Need/Subpopulation]],Table3[[Student Need/Subpopulation]:[Include in your intervention plan for this academic year?]],6,0)","v":"No"},"No"]
[null,null,"Basic Needs and Wellness","Lack of technology or Wi-Fi","If campus is closed, e-mail local students with information about where students can access wifi in areas on or surrounding campus.","a3",{"$f":"VLOOKUP(Index6[[#This Row],[Student Need/Subpopulation]],Table3[[Student Need/Subpopulation]:[Include in your intervention plan for this academic year?]],6,0)","v":"No"},"No"]
[null,null,"Basic Needs and Wellness","Mental health concerns","Refer student to institution counseling services, wellness office, or community agencies.","b1",{"$f":"VLOOKUP(Index6[[#This Row],[Student Need/Subpopulation]],Table3[[Student Need/Subpopulation]:[Include in your intervention plan for this academic year?]],6,0)","v":"No"},"No"]
[null,null,"Basic Needs and Wellness","Mental health concerns","E-mail students links to free online mental health resources to access including any available benefits through student health insurance.","b2",{"$f":"VLOOKUP(Index6[[#This Row],[Student Need/Subpopulation]],Table3[[Student Need/Subpopulation]:[Include in your intervention plan for this academic year?]],6,0)","v":"No"},"No"]
[null,null,"Basic Needs and Wellness","Mental health concerns","Share information about available support groups or peer-led organizations.","b3",{"$f":"VLOOKUP(Index6[[#This Row],[Student Need/Subpopulation]],Table3[[Student Need/Subpopulation]:[Include in your intervention plan for this academic year?]],6,0)","v":"No"},"No"]
[null,null,"Basic Needs and Wellness","Physical health concerns","Refer students to institution health services for an appointment.","c1",{"$f":"VLOOKUP(Index6[[#This Row],[Student Need/Subpopulation]],Table3[[Student Need/Subpopulation]:[Include in your intervention plan for this academic year?]],6,0)","v":"No"},"No"]
[null,null,"Basic Needs and Wellness","Physical health concerns","E-mail students information about relevant available benefits through student health insurance, including telehealth support.","c2",{"$f":"VLOOKUP(Index6[[#This Row],[Student Need/Subpopulation]],Table3[[Student Need/Subpopulation]:[Include in your intervention plan for this academic year?]],6,0)","v":"No"},"No"]
[null,null,"Basic Needs and Wellness","Physical health concerns","Refer students to local clinics or community health agencies.","c3",{"$f":"VLOOKUP(Index6[[#This Row],[Student Need/Subpopulation]],Table3[[Student Need/Subpopulation]:[Include in your intervention plan for this academic year?]],6,0)","v":"No"},"No"]
[null,null,"Basic Needs and Wellness","Food insecurity","Share information about food bank resources on campus or in community.","d1",{"$f":"VLOOKUP(Index6[[#This Row],[Student Need/Subpopulation]],Table3[[Student Need/Subpopulation]:[Include in your intervention plan for this academic year?]],6,0)","v":"No"},"No"]
[null,null,"Basic Needs and Wellness","Food insecurity","Send application to the student hardship fund/emergency grants.","d2",{"$f":"VLOOKUP(Index6[[#This Row],[Student Need/Subpopulation]],Table3[[Student Need/Subpopulation]:[Include in your intervention plan for this academic year?]],6,0)","v":"No"},"No"]
[null,null,"Basic Needs and Wellness","Housing insecurity","Send application to the student hardship fund/emergency grants.","e1",{"$f":"VLOOKUP(Index6[[#This Row],[Student Need/Subpopulation]],Table3[[Student Need/Subpopulation]:[Include in your intervention plan for this academic year?]],6,0)","v":"No"},"No"]
[null,null,"Basic Needs and Wellness","Housing insecurity","Refer students to local community agencies that provide housing assistance.","e2",{"$f":"VLOOKUP(Index6[[#This Row],[Student Need/Subpopulation]],Table3[[Student Need/Subpopulation]:[Include in your intervention plan for this academic year?]],6,0)","v":"No"},"No"]
{"$rows_left_out":58}
{"sheet":"3_Finalize Your Plan","index":2,"n_rows":77,"n_cols":17,"rows_kept":77,"cut":false,"hidden":false,"merged":[[3,2,4,5]]}
[null,null,null,null,null,null,null,null,null,null,null,null,null,null,null,null,"Student Success Collaborative"]
[null,"Step Three: Finalize Your Intervention Plan"]
[]
[null,null,"Instructions: Use the table below to finalize your intervention plan. Click the button to the right to automatically refresh the table below with your specific priorities from the previous tab. We provide suggestions for how to identify and outreach to students, as well as general timing. You then have additional space to plan your success metrics and any additional notes."]
[]
[]
[null,null,"Category","Student Need/Subpopulation","Intervention Action","When\nWhen in the term does this intervention occur?\n\nEdit our suggestions below to reflect your plans","Identification Tools\nHow will you identify the students for intervention?\n\nEdit our suggestions below to reflect your plans","Intervention Tools\nHow will you intervene with the students?\n\nEdit our suggestions below to reflect your plans","Who\nWho will (1) oversee and (2) execute this intervention? \n\nInput your plans below","Start Date\nWhat exact date will this intervention start?\n\nInput your plans below","End Date\nWhat exact date will this intervention end?\n\nInput your plans below","Process Metrics\nHow will you know the process is working?\n\nInput your plans below","Outcome Metrics\nHow will you measure overall success of the intervention?\n\nInput your plans below","Evaluation Date\nWhen will you assess this intervention?\n\nInput your plans below","Code","Priority?","Other Notes and Next Steps"]
[null,null,"Basic Needs and Wellness","Lack of technology or Wi-Fi","Refer students to IT department to get access to a loaner laptop or wifi hot spot.","Start of the term","Alerts, Progress Reports, Intake Survey, Quick Polls, Survey","E-mail Messaging, Alerts & Cases",null,null,null,null,null,null,"a1",{"$f":"VLOOKUP(Index62[[#This Row],[Code]],Index6[[#All],[Code]:[Include in your intervention plan for this academic year?]],3,0)","v":"No"}]
[null,null,"Basic Needs and Wellness","Lack of technology or Wi-Fi","Send application to the student hardship fund/emergency grants to apply for funds to purchase laptop or wifi hot spot.","Start of the term","Alerts, Progress Reports, Intake Survey, Quick Polls, Survey","E-mail Messaging",null,null,null,null,null,null,"a2",{"$f":"VLOOKUP(Index62[[#This Row],[Code]],Index6[[#All],[Code]:[Include in your intervention plan for this academic year?]],3,0)","v":"No"}]
[null,null,"Basic Needs and Wellness","Lack of technology or Wi-Fi","If campus is closed, e-mail local students with information about where students can access wifi in areas on or surrounding campus.","Start of the term","Alerts, Progress Reports, Intake Survey, Quick Polls, Survey","E-mail Messaging",null,null,null,null,null,null,"a3",{"$f":"VLOOKUP(Index62[[#This Row],[Code]],Index6[[#All],[Code]:[Include in your intervention plan for this academic year?]],3,0)","v":"No"}]
[null,null,"Basic Needs and Wellness","Mental health concerns","Refer student to institution counseling services, wellness office, or community agencies.","Anytime need identified","Alerts, Progress Reports, Intake Survey, Quick Polls, Survey","E-mail Messaging, Alerts & Cases",null,null,null,null,null,null,"b1",{"$f":"VLOOKUP(Index62[[#This Row],[Code]],Index6[[#All],[Code]:[Include in your intervention plan for this academic year?]],3,0)","v":"No"}]
[null,null,"Basic Needs and Wellness","Mental health concerns","E-mail students links to free online mental health resources to access including any available benefits through student health insurance.","Anytime need identified","Alerts, Progress Reports, Intake Survey, Quick Polls, Survey","E-mail Messaging",null,null,null,null,null,null,"b2",{"$f":"VLOOKUP(Index62[[#This Row],[Code]],Index6[[#All],[Code]:[Include in your intervention plan for this academic year?]],3,0)","v":"No"}]
[null,null,"Basic Needs and Wellness","Mental health concerns","Share information about available support groups or peer-led organizations.","Anytime need identified","Alerts, Progress Reports, Intake Survey, Quick Polls, Survey","E-mail Messaging",null,null,null,null,null,null,"b3",{"$f":"VLOOKUP(Index62[[#This Row],[Code]],Index6[[#All],[Code]:[Include in your intervention plan for this academic year?]],3,0)","v":"No"}]
[null,null,"Basic Needs and Wellness","Physical health concerns","Refer students to institution health services for an appointment.","Anytime need identified","Alerts, Progress Reports, Intake Survey, Quick Polls, Survey","E-mail Messaging",null,null,null,null,null,null,"c1",{"$f":"VLOOKUP(Index62[[#This Row],[Code]],Index6[[#All],[Code]:[Include in your intervention plan for this academic year?]],3,0)","v":"No"}]
[null,null,"Basic Needs and Wellness","Physical health concerns","E-mail students information about relevant available benefits through student health insurance, including telehealth support.","Anytime need identified","Alerts, Progress Reports, Intake Survey, Quick Polls, Survey","E-mail Messaging",null,null,null,null,null,null,"c2",{"$f":"VLOOKUP(Index62[[#This Row],[Code]],Index6[[#All],[Code]:[Include in your intervention plan for this academic year?]],3,0)","v":"No"}]
[null,null,"Basic Needs and Wellness","Physical health concerns","Refer students to local clinics or community health agencies.","Anytime need identified","Alerts, Progress Reports, Intake Survey, Quick Polls, Survey","E-mail Messaging",null,null,null,null,null,null,"c3",{"$f":"VLOOKUP(Index62[[#This Row],[Code]],Index6[[#All],[Code]:[Include in your intervention plan for this academic year?]],3,0)","v":"No"}]
[null,null,"Basic Needs and Wellness","Food insecurity","Share information about food bank resources on campus or in community.","Anytime need identified","Alerts, Progress Reports, Intake Survey, Quick Polls, Survey","E-mail Messaging",null,null,null,null,null,null,"d1",{"$f":"VLOOKUP(Index62[[#This Row],[Code]],Index6[[#All],[Code]:[Include in your intervention plan for this academic year?]],3,0)","v":"No"}]
[null,null,"Basic Needs and Wellness","Food insecurity","Send application to the student hardship fund/emergency grants.","Anytime need identified","Alerts, Progress Reports, Intake Survey, Quick Polls, Survey","E-mail Messaging",null,null,null,null,null,null,"d2",{"$f":"VLOOKUP(Index62[[#This Row],[Code]],Index6[[#All],[Code]:[Include in your intervention plan for this academic year?]],3,0)","v":"No"}]
[null,null,"Basic Needs and Wellness","Housing insecurity","Send application to the student hardship fund/emergency grants.","Anytime need identified","Alerts, Progress Reports, Intake Survey, Quick Polls, Survey","E-mail Messaging",null,null,null,null,null,null,"e1",{"$f":"VLOOKUP(Index62[[#This Row],[Code]],Index6[[#All],[Code]:[Include in your intervention plan for this academic year?]],3,0)","v":"No"}]
[null,null,"Basic Needs and Wellness","Housing insecurity","Refer students to local community agencies that provide housing assistance.","Anytime need identified","Alerts, Progress Reports, Intake Survey, Quick Polls, Survey","E-mail Messaging",null,null,null,null,null,null,"e2",{"$f":"VLOOKUP(Index62[[#This Row],[Code]],Index6[[#All],[Code]:[Include in your intervention plan for this academic year?]],3,0)","v":"No"}]
{"$rows_left_out":58}
{"sheet":"Lists and Sum","index":3,"n_rows":13,"n_cols":8,"rows_kept":13,"cut":false,"hidden":true,"merged":[[0,0,0,4]]}
["Lists"]
["How well do you think this type of student need/concern is being met?","VLOOKUP","How much effort would be needed to better meet these student needs/concerns?","VLOOKUP","What priority has your institution made this student need/concern?","VLOOKUP",null,"INCLUDE IN YOUR INTERVENTION CALENDAR?"]
["1 - Very Well",1,"1 - High Effort",1,"1 - Very Low Priority",1,null,"Yes"]
["2 - Somewhat Well",2,"2 - Some Effort",2,"2 - Low Priority",2,null,"No"]
["3 - Somewhat Poorly",3,"3 - Little Effort",3,"3 - Somewhat High Priority",3]
["4 - Very Poorly",4,"4 - Very Little Effort",4,"4 - High Priority",4]
[]
[]
[]
[]
[]
[]
["Protect password is \"eab2020\""]